بافه بالارو
type: Concept
alternative label: کابل بالارو
broader: بافه الکتریکی
preferred label: riser cable @en
scope note: بافه/ کابل داخلی برای استفاده در سیم‌کشی‌های عمودی در ساختمان‌های بدون مجرا

بافه الکتریکی
type: Concept
narrower: بافه بالارو
preferred label: electric cable @en