بافه ساختمند
type: Concept
alternative label: کابل ساختمند
broader: بافه الکتریکی
preferred label: structured cable @en
scope note: بافه‌ای با طراحی صحیح و مطابق با طرحی استاندارد برای اجرا و توسعه و گسترش

بافه الکتریکی
type: Concept
narrower: بافه ساختمند
preferred label: electric cable @en