فروگردان
type: Concept
broader: واگردان بسامد
preferred label: down-converter @en
scope note: افزاره‌ای که بسامدی را به بسامد پایین‌تر تبدیل می‌کند.

واگردان بسامد
type: Concept
narrower: فروگردان
preferred label: frequency converter @en