نورافکن سقف‌یاب
type: Concept
broader: چراغ جست‌وجو
preferred label: ceiling projector @en
scope note: نوعی نشانگر ارتفاع اَبر که در آن از یک چراغ جست‌وجو برای ارسال باریکۀ نور نازکی به پایۀ اَبر استفاده می‌کنند.

چراغ جست‌وجو
type: Concept
narrower: نورافکن سقف‌یاب
preferred label: searchlight @en