ولت‌سنج رهبندی‌بالا
type: Concept
broader: ولت‌سنج
preferred label: high-impedance voltmeter @en
scope note: ولت‌سنجی دارای ورودی با رهبندی بالا که خطای اندازه‌گیری را کاهش می‌دهد.

ولت‌سنج
type: Concept
narrower: ولت‌سنج رهبندی‌بالا
preferred label: voltmeter @en