ریزموج‌سنج
type: Concept
broader: موج‌سنج
preferred label: microwave wavemeter @en
scope note: وسیله‌ای برای اندازه‌گیری طولِ‌موج ریزموج‌ها

موج‌سنج
type: Concept
narrower: ریزموج‌سنج
preferred label: wavemeter @en