تقویت‌کننده برشگر
type: Concept
broader: تقویت‌کننده (الکترونیکی)
preferred label: chopper amplifier @en
related: برشگر (مدار)
scope note: تقویت‌کننده‌ای که ورودی «دی سی» آن پس از عبور از پالایه پایین گذر به وسیله یک یا دو برشگر به سیگنال مربعی «ای سی» تبدیل می‌شود.

تقویت‌کننده (الکترونیکی)
type: Concept
narrower: تقویت‌کننده برشگر
preferred label: amplifier (electronic) @en

برشگر (مدار)
type: Concept
preferred label: chopper (circuit) @en
related: تقویت‌کننده برشگر