چاپگر سطری
type: Concept
broader: چاپگر (رایانه)
preferred label: line printer @en
scope note: چاپگری که در آن اطلاعات یک سطر یکجا چاپ شود.

چاپگر (رایانه)
type: Concept
narrower: چاپگر سطری
preferred label: printer (computer) @en