رایانه شبکه‌ای
type: Concept
broader: رایانه رقمی
preferred label: network computer @en
scope note: رایانه‌ای معمولاً بدون دستگاه‌های جانبی که صرفاًً برای اتصال به شبکه‌های رایانه‌ای و بهره‌گیری از امکانات آنها به کار رود.

رایانه رقمی
type: Concept
narrower: رایانه شبکه‌ای
preferred label: digital computer @en