الکترود جریان
type: Concept
broader: الکترود
preferred label: current electrode @en
scope note: الکترود اتصال‌به‌زمینِ مدار گسیلنده در روش قطبش القایی

الکترود
type: Concept
narrower: الکترود جریان
preferred label: electrode @en