الکترود استاندارد هیدروژن
type: Concept
broader: الکترود هیدروژن
preferred label: standard hydrogen electrode @en
scope note: الکترود پلاتین در یک مولار اسید در مجاور گاز هیدروژن در فشار یک بار

الکترود هیدروژن
type: Concept
narrower: الکترود استاندارد هیدروژن
preferred label: hydrogen electrode @en