طیف‌نمای ریزموج
type: Concept
broader: افزاره ریزموج
preferred label: microwave spectroscope @en
scope note: وسیله‌ای برای بررسی شدت تابش ریزموج برحسب بسامد که نمونۀ مورد آزمایش آن را گسیل یا جذب می‌کند.

افزاره ریزموج
type: Concept
narrower: طیف‌نمای ریزموج
preferred label: microwave device @en