نوسانگر شنیداری
type: Concept
broader: نوسانگر (الکترونیک)
preferred label: audio oscillator @en
scope note: ابزار الکترونیکی مولد علامتی با بسامد معین یا در گسترۀ بسامدی معین در طیف شنیداری که از آن برای واسنجی ابزارهای سنجش صوت استفاده می‌شود.

نوسانگر (الکترونیک)
type: Concept
narrower: نوسانگر شنیداری
preferred label: oscillator (electronic) @en