نوسانگر دمشی
type: Concept
broader: نوسانگر (الکترونیک)
preferred label: pump oscillator @en
scope note: وسیله‌ای برای تولید جریان متناوب پربسامد در میزرها

نوسانگر (الکترونیک)
type: Concept
narrower: نوسانگر دمشی
preferred label: oscillator (electronic) @en