تراپاسخگر
type: Concept
narrower: تراپاسخگر راداری
preferred label: transponder @en

تراپاسخگر راداری
type: Concept
alternative label: نشان‌فرست راداری
broader: تراپاسخگر
preferred label: radar transponder @en
scope note: تراپاسخگر نصب‌شده در هواگرد که با دریافت کدِ تپ صحیح از رادار زمینی بلافاصله رمز شناسایی را در همان طولِ‌موج یا در طولِ‌موج متفاوت ارسال می‌کند.