آشکارساز صوتی
type: Concept
broader: آشکارساز
preferred label: acoustic detector @en
scope note: بخشی از گیرنده که وظیفۀ آن وامدوله کردن موج رادیویی مدوله‌شده به مؤلفه‌های شنیداری آن است.

آشکارساز
type: Concept
narrower: آشکارساز صوتی
preferred label: detector @en