آشکارساز هوابرد
type: Concept
broader: آشکارساز
preferred label: airborne detector @en
scope note: افزاره‌ای که با هواگرد حمل می‌شود و برای تعیین مکان یا تشخیص اشیا در هوا یا سطح زمین به ‌کار می‌رود.

آشکارساز
type: Concept
narrower: آشکارساز هوابرد
preferred label: detector @en