آشکارساز پرتو گاما
type: Concept
broader: آشکارساز نوری
preferred label: gamma-ray detector @en
related: پرتو گاما
scope note: وسیله‌ای برای آشکارسازی و اندازه‌گیری پرتوهای گامای ناشی از چشمه‌های متمرکز

آشکارساز نوری
type: Concept
narrower: آشکارساز پرتو گاما
preferred label: photodetector @en

پرتو گاما
type: Concept
preferred label: gamma ray @en
related: آشکارساز پرتو گاما