حسگر تار نوری نشانگرمیانجی
type: Concept
broader: حسگر تار نوری
preferred label: indicator-mediated fiber optic sensor @en
scope note: حسگری که در آن نور از منبع نور تا انتهای تار نوری حرکت می‌کند و در آنجا با عنصر شناسایی زیستی یا شیمیایی خاصی برهم‌کنش دارد.

حسگر تار نوری
type: Concept
narrower: حسگر تار نوری نشانگرمیانجی
preferred label: fiber optic sensor @en