نزداحسگر خازنی
type: Concept
broader: نزداحسگر
preferred label: capacitive proximity sensor @en
scope note: نزداحسگری که می‌تواند حضور هر جسم جامدی را که بر ظرفیت خازنی نسبی آن نسبت به زمین اثر بگذارد، تشخیص دهد.

نزداحسگر
type: Concept
narrower: نزداحسگر خازنی
preferred label: proximity sensor @en