نزداحسگر القایی
type: Concept
broader: نزداحسگر
preferred label: inductive proximity sensor @en
scope note: نزداحسگری که براساس تغییر ضریب القاوری ناشی از حضور شیء فلزی کار می‌کند.

نزداحسگر
type: Concept
narrower: نزداحسگر القایی
preferred label: proximity sensor @en