نزداحسگر فراصوت
type: Concept
broader: نزداحسگر
preferred label: ultrasound proximity sensor @en
scope note: نزداحسگری که تراگذار صوتی دارد و در بسامدهای فراصوتی بزرگ‌تر از بیست‌ هزار هرتز به ارتعاش درمی‌آید.

نزداحسگر
type: Concept
narrower: نزداحسگر فراصوت
preferred label: proximity sensor @en