شبکه حسگر بی‌سیم
type: Concept
broader: شبکه حسگر
preferred label: wireless sensor network @en

شبکه حسگر
type: Concept
broader: حسگر
narrower: شبکه حسگر بی‌سیم
preferred label: sensor network @en
scope note: شبکه‌ای از گره‌های پرشمار و مستقل از حسگرهای کوچک، که دارای توانایی حسگری و پردازش و ارتباطات هستند.

حسگر
type: Concept
narrower: شبکه حسگر
preferred label: sensor @en