مغناطیس‌سنج مطلق
type: Concept
broader: مغناطیس‌سنج
preferred label: absolute magnetometer @en
scope note: دستگاهی برای اندازه‌گیری شدت میدان مغناطیسی بدون ارجاع به نتایج حاصل از دستگاه‌های مغناطیسی دیگر

مغناطیس‌سنج
type: Concept
narrower: مغناطیس‌سنج مطلق
preferred label: magnetometer @en