نم‌سنج پوست‌روده‌ای
type: Concept
broader: نم‌سنج
preferred label: goldbeaters-skin hygrometer @en
scope note: نم‌سنجی که عنصر حساس آن از پوست روده است.

نم‌سنج
type: Concept
narrower: نم‌سنج پوست‌روده‌ای
preferred label: hygrometer @en