نم‌سنج کریپتونی
type: Concept
broader: نم‌سنج
preferred label: Krypton hygrometer @en
related: نم‌سنج لیمن ـ آلفا
scope note: نم‌سنجی که ازلحاظ فنی بسیار شبیه به نم‌سنج لیمن ــ آلفا است، با این تفاوت که در آن لولۀ تابندۀ کریپتون جانشین چشمۀ تابش هیدروژن شده است.

نم‌سنج لیمن ـ آلفا
type: Concept
preferred label: Lyman-alpha hygrometer @en
related: نم‌سنج کریپتونی

نم‌سنج
type: Concept
narrower: نم‌سنج کریپتونی
preferred label: hygrometer @en