نم‌سنج کریپتونی
type: Concept
preferred label: Krypton hygrometer @en
related: نم‌سنج لیمن ـ آلفا

نم‌سنج لیمن ـ آلفا
type: Concept
broader: نم‌سنج
preferred label: Lyman-alpha hygrometer @en
related: نم‌سنج کریپتونی
scope note: نم‌سنجی که با جذب تابش به‌کمک بخار آب در خط لیمن ـ آلفا، یعنی خط گسیل اتمی هیدروژن در 121/567 نانومتر، کار می‌کند.

نم‌سنج
type: Concept
narrower: نم‌سنج لیمن ـ آلفا
preferred label: hygrometer @en