نم‌سنج مکانیکی
type: Concept
broader: نم‌سنج
preferred label: mechanical hygrometer @en
scope note: نم‌سنجی ساخته‌شده از ماده‌ای آلی، مانند موی انسان، که تغییر رطوبت هوای محیط را به شیوۀ مکانیکی نمایش می‌دهد.

نم‌سنج
type: Concept
narrower: نم‌سنج مکانیکی
preferred label: hygrometer @en