دوربین آسمان‌پوش
type: Concept
broader: دوربین عکاسی
preferred label: all-sky camera @en
scope note: دوربینی که میدان دید آن سراسر یا تقریباً سراسر آسمان محلی را در یک قاب تصویر جای می‌دهد.

دوربین عکاسی
type: Concept
narrower: دوربین آسمان‌پوش
preferred label: camera @en