دوربین تصویرسنجی
type: Concept
broader: دوربین عکاسی
preferred label: photogrammetric camera @en
scope note: دوربینی که برای تصویرسنجی به کار می‌رود.

دوربین عکاسی
type: Concept
narrower: دوربین تصویرسنجی
preferred label: camera @en