تک‌فام‌ساز
type: Concept
alternative label: منبع نور تک‌رنگ
broader: طیف‌نگار
preferred label: monochromator @en
related: منبع نور
scope note: وسیله‌ای که از طیف پیوسته، تابشی تک‌فام تولید می‌کند.

طیف‌نگار
type: Concept
narrower: تک‌فام‌ساز
preferred label: spectrograph @en

منبع نور
type: Concept
preferred label: light source @en
related: تک‌فام‌ساز