طیف‌سنج جرمی زمان‌پروازی
type: Concept
broader: طیف‌سنج جرمی
preferred label: time-of-flight mass spectrometer @en
scope note: نوعی طیف‌سنج جِرمی که در آن یون‌ها برمبنای سرعت‌هایشان بدون اعمال هرگونه نیروی بیرونی جدا می‌شوند.

طیف‌سنج جرمی
type: Concept
narrower: طیف‌سنج جرمی زمان‌پروازی
preferred label: mass spectrometer @en