تلسکوپ پرتوکیهانی
type: Concept
broader: تلسکوپ
preferred label: cosmic-ray telescope @en
scope note: هر ابزاری برای آشکارسازی و جهت‌یابی پرتوهای کیهانی

تلسکوپ
type: Concept
narrower: تلسکوپ پرتوکیهانی
preferred label: telescope @en