تلسکوپ گالیله‌ای
type: Concept
broader: تلسکوپ شکستی
preferred label: Galilean telescope @en

تلسکوپ شکستی
type: Concept
broader: تلسکوپ
narrower: تلسکوپ گالیله‌ای
preferred label: refracting telescope @en
scope note: تلسکوپی که در آن از یک عدسی بزرگ کاو برای جمع‌آوری نور اجرام نجومی استفاده میشود.

تلسکوپ
type: Concept
narrower: تلسکوپ شکستی
preferred label: telescope @en