تلسکوپ فرابنفش
type: Concept
broader: تلسکوپ
preferred label: ultraviolet telescope @en
scope note: تلسکوپی که برای رصد در بازۀ طیفی فرابنفش طراحی شده‌ است.

تلسکوپ
type: Concept
narrower: تلسکوپ فرابنفش
preferred label: telescope @en