گران‌رَوی‌سنج استوانه‌ای هم‌محور
type: Concept
broader: گران‌روی‌سنج چرخان
preferred label: concentric cylinder viscometer @en
scope note: نوعی گران‌رَوی‌سنج چرخان که استوانۀ درونی آن با سرعت ثابتی می‌چرخد و از این طریق مقاومت در برابر حرکت و تنش برشی بین دو استوانه اندازه‌گیری می‌شود.

گران‌روی‌سنج چرخان
type: Concept
narrower: گران‌رَوی‌سنج استوانه‌ای هم‌محور
preferred label: rotational viscometer @en