نردبان انتهایی
type: Concept
broader: نردبان
preferred label: end ladder @en
related: واگن راه‌آهن
scope note: نردبانی که در انتهای واگن نصب می‌شود تا دسترسی از رکاب انتهایی به سکو را امکان‌پذیر سازد.

نردبان
type: Concept
narrower: نردبان انتهایی
preferred label: ladder @en

واگن راه‌آهن
type: Concept
preferred label: railroad car @en
related: نردبان انتهایی