آهنربای میراننده
type: Concept
broader: آهن‌ربا
preferred label: damping magnet @en
scope note: نوعی آهنربای دائمی که میدان آن در یک رسانای متحرک، جریان‌های گردابی ایجاد می‌کند و بدین‌سان نیرویی به وجود می‌آید که باعث میرایی حرکت رسانا می‌شود.

آهن‌ربا
type: Concept
narrower: آهنربای میراننده
preferred label: magnet @en