بمب شکافتی
type: Concept
alternative label: بمب اتمی
broader: بمب (تسلیحات)
preferred label: fission bomb @en
related: اورانیم
scope note: بمبی که انرژی انفجاری آن از مواد شکافت‌پذیر هسته‌ای نظیر اورانیم 235 تأمین می‌شود.

بمب (تسلیحات)
type: Concept
narrower: بمب شکافتی
preferred label: bomb (ordnance) @en

اورانیم
type: Concept
preferred label: uranium @en
related: بمب شکافتی