بمب درخشی
type: Concept
broader: بمب (تسلیحات)
preferred label: photoflash bomb @en
related: عکاسی نظامی
scope note: مواد آتش‌زایی که از هواگرد پرتاب می‌شود و با ایجاد نور زیاد امکان عکس‌برداری در شب را فراهم می‌سازد.

بمب (تسلیحات)
type: Concept
narrower: بمب درخشی
preferred label: bomb (ordnance) @en

عکاسی نظامی
type: Concept
preferred label: military photography @en
related: بمب درخشی