بمب دیرافت
type: Concept
broader: بمب (تسلیحات)
preferred label: retarded bomb @en
scope note: نوعی بمب غیرهدایت‌شونده (free-fallbomb) که دارای چتری کوچک در انتها برای کاهش سرعت پس از رهش است تا ایمنی هواپیما در پروازهای ارتفاع‌پایین افزایش یابد.

بمب (تسلیحات)
type: Concept
narrower: بمب دیرافت
preferred label: bomb (ordnance) @en