موشک پرتابشی بینابرد
type: Concept
broader: موشک پرتابشی
preferred label: intermediate-range ballistic missile @en
scope note: موشک پرتابشی با بُرد مؤثر 2700 تا 5500 کیلومتر

موشک پرتابشی
type: Concept
narrower: موشک پرتابشی بینابرد
preferred label: ballistic missile @en