موشک پرسرعت
type: Concept
broader: موشک هدایت‌شونده
preferred label: hypervelocity missile @en
scope note: موشکی با سرعت بیش از چهار کیلومتر در ثانیه

موشک هدایت‌شونده
type: Concept
narrower: موشک پرسرعت
preferred label: missile @en