موشک دورایست
type: Concept
broader: موشک هدایت‌شونده
preferred label: stand-off missile @en
scope note: نوعی موشک هوابه‌هوا یا هوابه‌زمین که بُرد مؤثر آن بیش از بُرد رادار هدف ‌است.

موشک هدایت‌شونده
type: Concept
narrower: موشک دورایست
preferred label: missile @en