پناهگاه (تهاجم)
type: Concept
broader: تجهیزات نظامی
preferred label: shelter (from attack) @en
related: پناهگاه (دفاع غیر نظامی)
scope note: محل سرپوشیده و امن برای استقرار انواع هواگَرد و ادوات و تجهیزات و نفرات که در برابر گلوله و بمب مقاوم باشد.

تجهیزات نظامی
type: Concept
narrower: پناهگاه (تهاجم)
preferred label: military equipment @en

پناهگاه (دفاع غیر نظامی)
type: Concept
preferred label: shelter (civil defense) @en
related: پناهگاه (تهاجم)