دوربین دوچشمی
type: Concept
broader: افزاره نوری
preferred label: binoculars @en
scope note: وسیله‌ای اپتیکی شامل دو تلسکوپ همسان در کنار یکدیگر

افزاره نوری
type: Concept
narrower: دوربین دوچشمی
preferred label: optical device @en