آینه دوریخت
type: Concept
broader: آینه
preferred label: bimorph mirror @en
scope note: نوعی آینۀ شکل‌پذیر که از یک جفت ویفر (wafer) فشاربرقی تشکیل شده است و براثر تحریک‌های الکتریکی تغییر شکل می‌دهد.

آینه
type: Concept
narrower: آینه دوریخت
preferred label: mirror @en