آینه واگرا
type: Concept
broader: آینه کوژ
preferred label: diverging mirror @en
scope note: آینه‌ای کوژ که پرتوهای موازی با محور را واگرا می‌کند.

آینه کوژ
type: Concept
narrower: آینه واگرا
preferred label: convex mirror @en