آینه واگرا
type: Concept
broader: آینه کوژ
preferred label: diverging mirror @en

آینه کوژ
type: Concept
broader: آینه
narrower: آینه واگرا
preferred label: convex mirror @en
scope note: آینه‌ای که سطح بازتابندۀ آن بخش برجستۀ سطحی خمیده است.

آینه
type: Concept
narrower: آینه کوژ
preferred label: mirror @en