آینه لانه‌زنبوری
type: Concept
broader: آینه
preferred label: honeycomb mirror @en
scope note: آینه‌ای که فضای بین دو سطح آن ساختاری مشبک به شکل لانۀ زنبور دارد.

آینه
type: Concept
narrower: آینه لانه‌زنبوری
preferred label: mirror @en